Reaction Details
TargetEpidermal growth factor receptor
LigandBDBM50051308
Substrate/Competitorn/a
Meas. Tech.ChEMBL_67042 (CHEMBL677880)
IC50 6±n/a nM
Citation Traxler, PMFuret, PMett, HBuchdunger, EMeyer, TLydon, N 4-(Phenylamino)pyrrolopyrimidines: potent and selective, ATP site directed inhibitors of the EGF-receptor protein tyrosine kinase. J Med Chem39:2285-92 (1996) 
 
Epidermal growth factor receptor
Name:Epidermal growth factor receptor
Type:Receptor Kinase Domain
Mol. Mass.:134279.59
Organism:Homo sapiens (Human)
Description:P00533
Residue:1210
BDBM50051308
NameBDBM50051308
Synonyms:(3-Chloro-phenyl)-(9H-pyrimido[4,5-b]indol-4-yl)-amine | CHEMBL306315
TypeSmall organic molecule
Emp. Form.C16H11ClN4
Mol. Mass.294.738
SMILESClc1cccc(Nc2ncnc3[nH]c4ccccc4c23)c1