Reaction Details
TargetEpidermal growth factor receptor
LigandBDBM50051317
Substrate/Competitorn/a
Meas. Tech.ChEMBL_67042 (CHEMBL677880)
IC50 27±n/a nM
Citation Traxler, PMFuret, PMett, HBuchdunger, EMeyer, TLydon, N 4-(Phenylamino)pyrrolopyrimidines: potent and selective, ATP site directed inhibitors of the EGF-receptor protein tyrosine kinase. J Med Chem39:2285-92 (1996) 
 
Epidermal growth factor receptor
Name:Epidermal growth factor receptor
Type:Receptor Kinase Domain
Mol. Mass.:134279.59
Organism:Homo sapiens (Human)
Description:P00533
Residue:1210
BDBM50051317
NameBDBM50051317
Synonyms:(3-Chloro-phenyl)-(5,6-dimethyl-7H-pyrrolo[2,3-d]pyrimidin-4-yl)-amine | CHEMBL306081
TypeSmall organic molecule
Emp. Form.C14H13ClN4
Mol. Mass.272.733
SMILESCc1[nH]c2ncnc(Nc3cccc(Cl)c3)c2c1C