Reaction Details
TargetAdenosylhomocysteinase
LigandBDBM50051435
Substrate/Competitorn/a
Meas. Tech.ChEMBL_196745 (CHEMBL803155)
Ki 43±n/a nM
Citation Liu, SYuan, CSBorchardt, RT Aristeromycin-5'-carboxaldehyde: a potent inhibitor of S-adenosyl-L-homocysteine hydrolase. J Med Chem39:2347-53 (1996) 
 
Adenosylhomocysteinase
Name:Adenosylhomocysteinase
Type:PROTEIN
Mol. Mass.:47714.06
Organism:Homo sapiens (Human)
Description:ChEMBL_1507791
Residue:432
BDBM50051435
NameBDBM50051435
Synonyms:5'-Dehydroadenosine 9-beta-D-ribo-pentodialdo-1,4-furanosyl-9H-purin-6-amine | CHEMBL308037
TypeSmall organic molecule
Emp. Form.C10H11N5O4
Mol. Mass.265.2254
SMILESNc1ncnc2n(cnc12)[C@@H]1O[C@H](C=O)[C@@H](O)[C@H]1O