Reaction Details
TargetGenome polyprotein
LigandBDBM50501163
Substrate/Competitorn/a
Meas. Tech.ChEMBL_1614753 (CHEMBL3856822)
IC50 230±n/a nM
Citation Kim, BKKo, HJeon, ESJu, ESJeong, LSKim, YC 2,3,4-Trihydroxybenzyl-hydrazide analogues as novel potent coxsackievirus B3 3C protease inhibitors. Eur J Med Chem120:202-16 (2016) 
 
Genome polyprotein
Name:Genome polyprotein
Type:Enzyme
Mol. Mass.:243464.96
Organism:Coxsackievirus B3 (strain Nancy)
Description:P03313
Residue:2185
BDBM50501163
NameBDBM50501163
Synonyms:CHEMBL3979141
TypeSmall organic molecule
Emp. Form.C26H30FN5O7
Mol. Mass.543.5441
SMILESCC(C)[C@H](NC(=O)c1cc(C)on1)C(=O)N[C@@H](Cc1ccc(F)cc1)C(=O)NNCc1ccc(O)c(O)c1O