Reaction Details
TargetGenome polyprotein
LigandBDBM50501169
Substrate/Competitorn/a
Meas. Tech.ChEMBL_1614753 (CHEMBL3856822)
IC50 160±n/a nM
Citation Kim, BKKo, HJeon, ESJu, ESJeong, LSKim, YC 2,3,4-Trihydroxybenzyl-hydrazide analogues as novel potent coxsackievirus B3 3C protease inhibitors. Eur J Med Chem120:202-16 (2016) 
 
Genome polyprotein
Name:Genome polyprotein
Type:Enzyme
Mol. Mass.:243464.96
Organism:Coxsackievirus B3 (strain Nancy)
Description:P03313
Residue:2185
BDBM50501169
NameBDBM50501169
Synonyms:CHEMBL3955342
TypeSmall organic molecule
Emp. Form.C17H18N2O5
Mol. Mass.330.3352
SMILESOc1ccc(CCCC(=O)N\N=C\c2ccc(O)c(O)c2O)cc1