Reaction Details
TargetGenome polyprotein
LigandBDBM50501178
Substrate/Competitorn/a
Meas. Tech.ChEMBL_1614753 (CHEMBL3856822)
IC50 640±n/a nM
Citation Kim, BKKo, HJeon, ESJu, ESJeong, LSKim, YC 2,3,4-Trihydroxybenzyl-hydrazide analogues as novel potent coxsackievirus B3 3C protease inhibitors. Eur J Med Chem120:202-16 (2016) 
 
Genome polyprotein
Name:Genome polyprotein
Type:Enzyme
Mol. Mass.:243464.96
Organism:Coxsackievirus B3 (strain Nancy)
Description:P03313
Residue:2185
BDBM50501178
NameBDBM50501178
Synonyms:CHEMBL3963346
TypeSmall organic molecule
Emp. Form.C17H17FN2O4
Mol. Mass.332.3263
SMILESOc1ccc(\C=N\NC(=O)CCCc2ccc(F)cc2)c(O)c1O