Reaction Details
TargetGenome polyprotein
LigandBDBM50501193
Substrate/Competitorn/a
Meas. Tech.ChEMBL_1614753 (CHEMBL3856822)
IC50 230±n/a nM
Citation Kim, BKKo, HJeon, ESJu, ESJeong, LSKim, YC 2,3,4-Trihydroxybenzyl-hydrazide analogues as novel potent coxsackievirus B3 3C protease inhibitors. Eur J Med Chem120:202-16 (2016) 
 
Genome polyprotein
Name:Genome polyprotein
Type:Enzyme
Mol. Mass.:243464.96
Organism:Coxsackievirus B3 (strain Nancy)
Description:P03313
Residue:2185
BDBM50501193
NameBDBM50501193
Synonyms:CHEMBL3954125
TypeSmall organic molecule
Emp. Form.C18H21FN2O4
Mol. Mass.348.3687
SMILESOc1ccc(CNNC(=O)CCCCc2ccc(F)cc2)c(O)c1O