Reaction Details
TargetRibonucleoside-diphosphate reductase subunit M2
LigandBDBM50051771
Substrate/Competitorn/a
Meas. Tech.ChEMBL_195255 (CHEMBL796773)
IC50 9000±n/a nM
Citation Liu, MCLin, TSCory, JGCory, AHSartorelli, AC Synthesis and biological activity of 3- and 5-amino derivatives of pyridine-2-carboxaldehyde thiosemicarbazone. J Med Chem39:2586-93 (1996) 
 
Ribonucleoside-diphosphate reductase subunit M2
Name:Ribonucleoside-diphosphate reductase subunit M2
Type:PROTEIN
Mol. Mass.:44868.59
Organism:Homo sapiens (Human)
Description:ChEMBL_195255
Residue:389
BDBM50051771
NameBDBM50051771
Synonyms:(1Z,N'E)-N'-((3,5-diaminopyridin-2-yl)methylene)carbamohydrazonothioic acid | CHEMBL86910
TypeSmall organic molecule
Emp. Form.C7H10N6S
Mol. Mass.210.26
SMILESNC(=S)NN=Cc1ncc(N)cc1N