Reaction Details
TargetRibonucleoside-diphosphate reductase subunit M2
LigandBDBM50051772
Substrate/Competitorn/a
Meas. Tech.ChEMBL_195255 (CHEMBL796773)
IC50 820.0±n/a nM
Citation Liu, MCLin, TSCory, JGCory, AHSartorelli, AC Synthesis and biological activity of 3- and 5-amino derivatives of pyridine-2-carboxaldehyde thiosemicarbazone. J Med Chem39:2586-93 (1996) 
 
Ribonucleoside-diphosphate reductase subunit M2
Name:Ribonucleoside-diphosphate reductase subunit M2
Type:PROTEIN
Mol. Mass.:44868.59
Organism:Homo sapiens (Human)
Description:ChEMBL_195255
Residue:389
BDBM50051772
NameBDBM50051772
Synonyms:(Z)-N'-(5-amino-6-formylpyridin-2-yl)carbamohydrazonothioic acid | CHEMBL315999
TypeSmall organic molecule
Emp. Form.C7H9N5OS
Mol. Mass.211.244
SMILESNC(=S)NNc1ccc(N)c(C=O)n1