Reaction Details
TargetProtein kinase C beta type
LigandBDBM50052041
Substrate/Competitorn/a
Meas. Tech.ChEMBL_160460 (CHEMBL761757)
IC50 30±n/a nM
Citation Jirousek, MRGillig, JRGonzalez, CMHeath, WFMcDonald, JHNeel, DARito, CJSingh, UStramm, LEMelikian-Badalian, ABaevsky, MBallas, LMHall, SEWinneroski, LLFaul, MM (S)-13-[(dimethylamino)methyl]-10,11,14,15-tetrahydro-4,9:16, 21-dimetheno-1H, 13H-dibenzo[e,k]pyrrolo[3,4-h][1,4,13]oxadiazacyclohexadecene-1,3(2H)-d ione (LY333531) and related analogues: isozyme selective inhibitors of protein kinase C beta. J Med Chem39:2664-71 (1996) 
 
Protein kinase C beta type
Name:Protein kinase C beta type
Type:Enzyme
Mol. Mass.:76873.67
Organism:Homo sapiens (Human)
Description:The recombinant human PKC enzymes were produced using a baculovirus expression system in SF9 cells
Residue:671
BDBM50052041
NameBDBM50052041
Synonyms:18-(4-methylhexahydro-1-pyrazinylmethyl)-(18S)-17-oxa-4,14,21-triazahexacyclo[19.6.1.17,14.02,6.08,13.022,27]nonacosa-1(28),2(6),7(29),8(13),9,11,22(27),23,25-nonaene-3,5-dione | CHEMBL91959
TypeSmall organic molecule
Emp. Form.C31H33N5O3
Mol. Mass.523.6254
SMILESCN1CCN(C[C@@H]2CCn3cc(C4=C(C(=O)NC4=O)c4cn(CCO2)c2ccccc42)c2ccccc32)CC1