Reaction Details
TargetReverse transcriptase/RNaseH
LigandBDBM50052044
Substrate/Competitorn/a
Meas. Tech.ChEMBL_195066 (CHEMBL797521)
IC50>300000±n/a nM
Citation Campiani, GNacci, VFiorini, IDe Filippis, MPGarofalo, AGreco, GNovellino, EAltamura, SDi Renzo, L Pyrrolobenzothiazepinones and pyrrolobenzoxazepinones: novel and specific non-nucleoside HIV-1 reverse transcriptase inhibitors with antiviral activity. J Med Chem39:2672-80 (1996) 
 
Reverse transcriptase/RNaseH
Name:Reverse transcriptase/RNaseH
Type:PROTEIN
Mol. Mass.:65229.15
Organism:Human immunodeficiency virus 1
Description:ChEMBL_1473730
Residue:566
BDBM50052044
NameBDBM50052044
Synonyms:5-Ethyl-6,6-dioxo-5-phenyl-5,6-dihydro-6lambda*6*-thia-10b-aza-benzo[e]azulen-4-one | CHEMBL88838
TypeSmall organic molecule
Emp. Form.C20H17NO3S
Mol. Mass.351.419
SMILESCCC1(c2ccccc2)C(=O)c2cccn2-c2ccccc2S1(=O)=O