Reaction Details
TargetReverse transcriptase/RNaseH
LigandBDBM50052049
Substrate/Competitorn/a
Meas. Tech.ChEMBL_195066 (CHEMBL797521)
IC50 150000±n/a nM
Citation Campiani, GNacci, VFiorini, IDe Filippis, MPGarofalo, AGreco, GNovellino, EAltamura, SDi Renzo, L Pyrrolobenzothiazepinones and pyrrolobenzoxazepinones: novel and specific non-nucleoside HIV-1 reverse transcriptase inhibitors with antiviral activity. J Med Chem39:2672-80 (1996) 
 
Reverse transcriptase/RNaseH
Name:Reverse transcriptase/RNaseH
Type:PROTEIN
Mol. Mass.:65229.15
Organism:Human immunodeficiency virus 1
Description:ChEMBL_1473730
Residue:566
BDBM50052049
NameBDBM50052049
Synonyms:5-Ethyl-5-phenyl-6-oxa-12b-aza-naphtho[2,3-e]azulen-4-one | CHEMBL88836
TypeSmall organic molecule
Emp. Form.C24H19NO2
Mol. Mass.353.4132
SMILESCCC1(Oc2cc3ccccc3cc2-n2cccc2C1=O)c1ccccc1