Reaction Details
TargetReverse transcriptase/RNaseH
LigandBDBM50052061
Substrate/Competitorn/a
Meas. Tech.ChEMBL_195066 (CHEMBL797521)
IC50>300000±n/a nM
Citation Campiani, GNacci, VFiorini, IDe Filippis, MPGarofalo, AGreco, GNovellino, EAltamura, SDi Renzo, L Pyrrolobenzothiazepinones and pyrrolobenzoxazepinones: novel and specific non-nucleoside HIV-1 reverse transcriptase inhibitors with antiviral activity. J Med Chem39:2672-80 (1996) 
 
Reverse transcriptase/RNaseH
Name:Reverse transcriptase/RNaseH
Type:PROTEIN
Mol. Mass.:65229.15
Organism:Human immunodeficiency virus 1
Description:ChEMBL_1473730
Residue:566
BDBM50052061
NameBDBM50052061
Synonyms:5-Phenyl-6-oxa-10b-aza-benzo[e]azulen-4-one | CHEMBL327869
TypeSmall organic molecule
Emp. Form.C18H13NO2
Mol. Mass.275.3013
SMILESO=C1C(Oc2ccccc2-n2cccc12)c1ccccc1