Reaction Details
TargetHistone-lysine N-methyltransferase, H3 lysine-79 specific
LigandBDBM50501645
Substrate/Competitorn/a
Meas. Tech.ChEMBL_1656617 (CHEMBL4006087)
Kd 17270±n/a nM
Citation Wang, YLi, LZhang, BXing, JChen, SWan, WSong, YJiang, HJiang, HLuo, CZheng, M Discovery of Novel Disruptor of Silencing Telomeric 1-Like (DOT1L) Inhibitors using a Target-Specific Scoring Function for the (S)-Adenosyl-l-methionine (SAM)-Dependent Methyltransferase Family. J Med Chem60:2026-2036 (2017) 
 
Histone-lysine N-methyltransferase, H3 lysine-79 specific
Name:Histone-lysine N-methyltransferase, H3 lysine-79 specific
Type:Protein
Mol. Mass.:184911.91
Organism:Homo sapiens (Human)
Description:Q8TEK3
Residue:1537
BDBM50501645
NameBDBM50501645
Synonyms:CHEMBL4084281
TypeSmall organic molecule
Emp. Form.C16H10FN7S
Mol. Mass.351.361
SMILESFc1cccc(c1)-c1nn2c(Cn3nnc4ccccc34)nnc2s1