Reaction Details
Target5-lipoxygenase
LigandBDBM50052466
Substrate/Competitorn/a
Meas. Tech.ChEMBL_3988 (CHEMBL619260)
IC50 2000±n/a nM
Citation Müller, KHuang, HSWiegrebe, W Antipsoriatic anthrones with modulated redox properties. 3. 10-thio-substituted 1,8-dihydroxy-9(10H)-anthracenones as inhibitors of keratinocyte growth, 5-lipoxygenase, and the formation of 12(S)-HETE in mouse epidermis. J Med Chem39:3132-8 (1996) 
 
5-lipoxygenase
Name:5-lipoxygenase
Synonyms:Arachidonate 5-lipoxygenase
Type:PROTEIN
Mol. Mass.:49994.23
Organism:Bos taurus
Description:ChEMBL_157766
Residue:430
BDBM50052466
NameBDBM50052466
TypeSmall organic molecule
Emp. Form.C17H14O5S
Mol. Mass.330.355
SMILESOC(=O)CCSC1c2cccc(O)c2C(=O)c2c(O)cccc12