Reaction Details
TargetAlpha-2A adrenergic receptor
LigandBDBM50052882
Substrate/Competitorn/a
Meas. Tech.ChEMBL_33075 (CHEMBL647722)
Ki 1.2±n/a nM
Citation Munk, SAHarcourt, DAmbrus, GDenys, LGluchowski, CBurke, JAKharlamb, ABManlapaz, CAPadillo, EURunde, EWilliams, LWheeler, LAGarst, ME Synthesis and evaluation of 2-[(5-methylbenz-1-ox-4-azin-6-yl)imino]imidazoline, a potent, peripherally acting alpha 2 adrenoceptor agonist. J Med Chem39:3533-8 (1996) 
 
Alpha-2A adrenergic receptor
Name:Alpha-2A adrenergic receptor
Type:Enzyme
Mol. Mass.:48979.91
Organism:Homo sapiens (Human)
Description:P08913
Residue:465
BDBM50052882
NameBDBM50052882
Synonyms:AGN-193080 Imidazolidin-2-ylidene-(5-methyl-3,4-dihydro-2H-benzo[1,4]oxazin-6-yl)-amine
TypeSmall organic molecule
Emp. Form.C12H16N4O
Mol. Mass.232.2816
SMILES[#6]-c1c(ccc2-[#8]-[#6]-[#6]-[#7]-c12)\[#7]=[#6]-1/[#7]-[#6]-[#6]-[#7]-1