Reaction Details
TargetATP-citrate synthase
LigandBDBM50052987
Substrate/Competitorn/a
Meas. Tech.ChEMBL_29506 (CHEMBL643072)
Ki 26000±n/a nM
Citation Gribble, ADDolle, REShaw, AMcNair, DNovelli, RNovelli, CESlingsby, BPShah, VPTew, DSaxty, BAAllen, MGroot, PHPearce, NYates, J ATP-citrate lyase as a target for hypolipidemic intervention. Design and synthesis of 2-substituted butanedioic acids as novel, potent inhibitors of the enzyme. J Med Chem39:3569-84 (1996) 
 
ATP-citrate synthase
Name:ATP-citrate synthase
Type:PROTEIN
Mol. Mass.:120848.43
Organism:Homo sapiens (Human)
Description:ChEMBL_455196
Residue:1101
BDBM50052987
NameBDBM50052987
Synonyms:2-[6-(4-Chloro-2-nitro-phenyl)-hexylsulfanylmethyl]-2-hydroxy-succinic acid | CHEMBL120265
TypeSmall organic molecule
Emp. Form.C17H22ClNO7S
Mol. Mass.419.877
SMILESOC(=O)CC(O)(CSCCCCCCc1ccc(Cl)cc1[N+]([O-])=O)C(O)=O