Reaction Details
TargetATP-citrate synthase
LigandBDBM50052999
Substrate/Competitorn/a
Meas. Tech.ChEMBL_29519 (CHEMBL640283)
Ki 93000±n/a nM
Citation Gribble, ADDolle, REShaw, AMcNair, DNovelli, RNovelli, CESlingsby, BPShah, VPTew, DSaxty, BAAllen, MGroot, PHPearce, NYates, J ATP-citrate lyase as a target for hypolipidemic intervention. Design and synthesis of 2-substituted butanedioic acids as novel, potent inhibitors of the enzyme. J Med Chem39:3569-84 (1996) 
 
ATP-citrate synthase
Name:ATP-citrate synthase
Type:PROTEIN
Mol. Mass.:120645.65
Organism:Rattus norvegicus
Description:ChEMBL_857791
Residue:1100
BDBM50052999
NameBDBM50052999
Synonyms:2-Hydroxy-2-(6-naphthalen-2-yl-hexylsulfanylmethyl)-succinic acid | CHEMBL121234
TypeSmall organic molecule
Emp. Form.C21H26O5S
Mol. Mass.390.493
SMILESOC(=O)CC(O)(CSCCCCCCc1ccc2ccccc2c1)C(O)=O