Reaction Details
TargetATP-citrate synthase
LigandBDBM50053013
Substrate/Competitorn/a
Meas. Tech.ChEMBL_29504 (CHEMBL642005)
Ki 121000±n/a nM
Citation Gribble, ADDolle, REShaw, AMcNair, DNovelli, RNovelli, CESlingsby, BPShah, VPTew, DSaxty, BAAllen, MGroot, PHPearce, NYates, J ATP-citrate lyase as a target for hypolipidemic intervention. Design and synthesis of 2-substituted butanedioic acids as novel, potent inhibitors of the enzyme. J Med Chem39:3569-84 (1996) 
 
ATP-citrate synthase
Name:ATP-citrate synthase
Type:PROTEIN
Mol. Mass.:120848.43
Organism:Homo sapiens (Human)
Description:ChEMBL_455196
Residue:1101
BDBM50053013
NameBDBM50053013
Synonyms:2-[6-(3,5-Dichloro-pyridin-4-yl)-hexylsulfanylmethyl]-2-hydroxy-succinic acid | CHEMBL331902
TypeSmall organic molecule
Emp. Form.C16H21Cl2NO5S
Mol. Mass.410.313
SMILESOC(=O)CC(O)(CSCCCCCCc1c(Cl)cncc1Cl)C(O)=O