Reaction Details
TargetTarget of rapamycin complex 2 subunit MAPKAP1
LigandBDBM50348452
Substrate/Competitorn/a
Meas. Tech.ChEMBL_1809504 (CHEMBL4308964)
IC50 2.8±n/a nM
Citation He, SLi, QJiang, XLu, XFeng, FQu, WChen, YSun, H Design of Small Molecule Autophagy Modulators: A Promising Druggable Strategy. J Med Chem61:4656-4687 (2018) 
 
Target of rapamycin complex 2 subunit MAPKAP1
Name:Target of rapamycin complex 2 subunit MAPKAP1
Type:PROTEIN
Mol. Mass.:59129.70
Organism:Homo sapiens
Description:ChEMBL_119716
Residue:522
BDBM50348452
NameBDBM50348452
Synonyms:AZD-8055 US9102670, 1a
TypeSmall organic molecule
Emp. Form.C25H31N5O4
Mol. Mass.465.5447
SMILESCOc1ccc(cc1CO)-c1ccc2c(nc(nc2n1)N1CCOC[C@@H]1C)N1CCOC[C@@H]1C