Reaction Details
TargetTarget of rapamycin complex subunit LST8
LigandBDBM50348452
Substrate/Competitorn/a
Meas. Tech.ChEMBL_1809503 (CHEMBL4308963)
IC50 0.800000±n/a nM
Citation He, SLi, QJiang, XLu, XFeng, FQu, WChen, YSun, H Design of Small Molecule Autophagy Modulators: A Promising Druggable Strategy. J Med Chem61:4656-4687 (2018) 
 
Target of rapamycin complex subunit LST8
Name:Target of rapamycin complex subunit LST8
Type:PROTEIN
Mol. Mass.:35871.25
Organism:Homo sapiens
Description:ChEMBL_118692
Residue:326
BDBM50348452
NameBDBM50348452
Synonyms:AZD-8055 US9102670, 1a
TypeSmall organic molecule
Emp. Form.C25H31N5O4
Mol. Mass.465.5447
SMILESCOc1ccc(cc1CO)-c1ccc2c(nc(nc2n1)N1CCOC[C@@H]1C)N1CCOC[C@@H]1C