Reaction Details
TargetDelta-type opioid receptor
LigandBDBM50503600
Substrate/Competitorn/a
Meas. Tech.ChEMBL_1811155 (CHEMBL4310615)
Ki 2.0±n/a nM
Citation Inagaki, MKume, MTamura, YHara, SGoto, YHaga, NHasegawa, TNakamura, TKoike, KOonishi, SKanemasa, TKai, H Discovery of naldemedine: A potent and orally available opioid receptor antagonist for treatment of opioid-induced adverse effects. Bioorg Med Chem Lett29:73-77 (2019) 
 
Delta-type opioid receptor
Name:Delta-type opioid receptor
Type:G Protein-Coupled Receptor (GPCR)
Mol. Mass.:40382.98
Organism:Homo sapiens (Human)
Description:Competition binding assays were carried out using membrane preparations from transfected HN9.10 cells that constitutively expressed the delta opioid receptor.
Residue:372
BDBM50503600
NameBDBM50503600
Synonyms:CHEMBL4542825
TypeSmall organic molecule
Emp. Form.C24H30N2O5
Mol. Mass.426.5054
SMILES[H][C@@]12Oc3c4c(C[C@@]5([H])N(CC6CC6)CC[C@@]14[C@@]5(O)CC(C(=O)NC(C)C)=C2O)ccc3O