Reaction Details
TargetMu-type opioid receptor
LigandBDBM50503596
Substrate/Competitorn/a
Meas. Tech.ChEMBL_1811154 (CHEMBL4310614)
Ki 1.1±n/a nM
Citation Inagaki, MKume, MTamura, YHara, SGoto, YHaga, NHasegawa, TNakamura, TKoike, KOonishi, SKanemasa, TKai, H Discovery of naldemedine: A potent and orally available opioid receptor antagonist for treatment of opioid-induced adverse effects. Bioorg Med Chem Lett29:73-77 (2019) 
 
Mu-type opioid receptor
Name:Mu-type opioid receptor
Type:G Protein-Coupled Receptor (GPCR)
Mol. Mass.:44789.51
Organism:Homo sapiens (Human)
Description:P35372
Residue:400
BDBM50503596
NameBDBM50503596
Synonyms:CHEMBL4561876
TypeSmall organic molecule
Emp. Form.C28H30N2O5
Mol. Mass.474.5482
SMILES[H][C@@]12Oc3c4c(C[C@@]5([H])N(CC6CC6)CC[C@@]14[C@@]5(O)CC(C(=O)NCc1ccccc1)=C2O)ccc3O