Reaction Details
TargetDelta-type opioid receptor
LigandBDBM50503611
Substrate/Competitorn/a
Meas. Tech.ChEMBL_1811155 (CHEMBL4310615)
Ki 1.000000±n/a nM
Citation Inagaki, MKume, MTamura, YHara, SGoto, YHaga, NHasegawa, TNakamura, TKoike, KOonishi, SKanemasa, TKai, H Discovery of naldemedine: A potent and orally available opioid receptor antagonist for treatment of opioid-induced adverse effects. Bioorg Med Chem Lett29:73-77 (2019) 
 
Delta-type opioid receptor
Name:Delta-type opioid receptor
Type:G Protein-Coupled Receptor (GPCR)
Mol. Mass.:40382.98
Organism:Homo sapiens (Human)
Description:Competition binding assays were carried out using membrane preparations from transfected HN9.10 cells that constitutively expressed the delta opioid receptor.
Residue:372
BDBM50503611
NameBDBM50503611
Synonyms:CHEMBL4468216
TypeSmall organic molecule
Emp. Form.C27H25ClN2O5
Mol. Mass.492.951
SMILES[H][C@@]12Oc3c4c(C[C@@]5([H])N(CC6CC6)CC[C@@]14[C@@]5(O)Cc1c2[nH]c2c(Cl)c(ccc12)C(O)=O)ccc3O