Reaction Details
TargetMu-type opioid receptor
LigandBDBM50503598
Substrate/Competitorn/a
Meas. Tech.ChEMBL_1811154 (CHEMBL4310614)
Ki 1.4±n/a nM
Citation Inagaki, MKume, MTamura, YHara, SGoto, YHaga, NHasegawa, TNakamura, TKoike, KOonishi, SKanemasa, TKai, H Discovery of naldemedine: A potent and orally available opioid receptor antagonist for treatment of opioid-induced adverse effects. Bioorg Med Chem Lett29:73-77 (2019) 
 
Mu-type opioid receptor
Name:Mu-type opioid receptor
Type:G Protein-Coupled Receptor (GPCR)
Mol. Mass.:44789.51
Organism:Homo sapiens (Human)
Description:P35372
Residue:400
BDBM50503598
NameBDBM50503598
Synonyms:CHEMBL4551066
TypeSmall organic molecule
Emp. Form.C23H27NO5
Mol. Mass.397.4642
SMILES[H][C@@]12Oc3c4c(C[C@@]5([H])N(CC6CC6)CC[C@@]14[C@@]5(O)CC(C(=O)CC)=C2O)ccc3O