Reaction Details
TargetGag-Pol polyprotein [489-587]
LigandBDBM50054164
Substrate/Competitorn/a
Meas. Tech.ChEMBL_160750 (CHEMBL769064)
Ki 0.035±n/a nM
Citation Wilkerson, WWAkamike, ECheatham, WWHollis, AYCollins, RDDeLucca, ILam, PYRu, Y HIV protease inhibitory bis-benzamide cyclic ureas: a quantitative structure-activity relationship analysis. J Med Chem39:4299-312 (1996) 
 
Gag-Pol polyprotein [489-587]
Name:Gag-Pol polyprotein [489-587]
Type:Enzyme Subunit
Mol. Mass.:10781.16
Organism:Human immunodeficiency virus type 1
Description:P04585[489-587]
Residue:99
BDBM50054164
NameBDBM50054164
Synonyms:5-bromo-2-{3-[4,7-dibenzyl-3-[3-(5-bromo-2-pyridylcarbamoyl)benzyl]-5,6-dihydroxy-2-oxo-(4R,5S,6S,7R)-1,3-diazepan-1-ylmethyl]phenylcarboxamido}pyridine | CHEMBL431027
TypeSmall organic molecule
Emp. Form.C45H40Br2N6O5
Mol. Mass.904.644
SMILESO[C@@H]1[C@@H](O)[C@@H](Cc2ccccc2)N(Cc2cccc(c2)C(=O)Nc2ccc(Br)cn2)C(=O)N(Cc2cccc(c2)C(=O)Nc2ccc(Br)cn2)[C@@H]1Cc1ccccc1