Reaction Details
TargetGag-Pol polyprotein [489-587]
LigandBDBM50054177
Substrate/Competitorn/a
Meas. Tech.ChEMBL_160750 (CHEMBL769064)
Ki 0.045±n/a nM
Citation Wilkerson, WWAkamike, ECheatham, WWHollis, AYCollins, RDDeLucca, ILam, PYRu, Y HIV protease inhibitory bis-benzamide cyclic ureas: a quantitative structure-activity relationship analysis. J Med Chem39:4299-312 (1996) 
 
Gag-Pol polyprotein [489-587]
Name:Gag-Pol polyprotein [489-587]
Type:Enzyme Subunit
Mol. Mass.:10781.16
Organism:Human immunodeficiency virus type 1
Description:P04585[489-587]
Residue:99
BDBM50054177
NameBDBM50054177
Synonyms:(4alpha,5alpha,6beta,7beta)-3,3'-[[Tetrahydro-5,6-dihydroxy-2-oxo-4,7-bis(phenylmethyl)-1H-1,3-diazepine-1,3(2H)-diyl]bis-methylene)]bis[N-(methyloxy)benzamide] CHEMBL313734
TypeSmall organic molecule
Emp. Form.C37H40N4O7
Mol. Mass.652.7361
SMILESCONC(=O)c1cccc(CN2[C@H](Cc3ccccc3)[C@H](O)[C@@H](O)[C@@H](Cc3ccccc3)N(Cc3cccc(c3)C(=O)NOC)C2=O)c1