Reaction Details
TargetCannabinoid receptor 1
LigandBDBM50054469
Substrate/Competitorn/a
Meas. Tech.ChEMBL_46807 (CHEMBL659694)
Ki 1380±n/a nM
Citation Khanolkar, ADAbadji, VLin, SHill, WATaha, GAbouzid, KMeng, ZFan, PMakriyannis, A Head group analogs of arachidonylethanolamide, the endogenous cannabinoid ligand. J Med Chem39:4515-9 (1996) 
 
Cannabinoid receptor 1
Name:Cannabinoid receptor 1
Type:G Protein-Coupled Receptor (GPCR)
Mol. Mass.:52856.55
Organism:Rattus norvegicus (rat)
Description:P20272
Residue:473
BDBM50054469
NameBDBM50054469
Synonyms:(5Z,8Z,11Z,14Z)-Icosa-5,8,11,14-tetraenethioic acid (2-hydroxy-ethyl)-amide | CHEMBL342659
TypeSmall organic molecule
Emp. Form.C22H37NOS
Mol. Mass.363.6
SMILESCCCCC\C=C/C\C=C/C\C=C/C\C=C/CCCC(=S)NCCO