Reaction Details
TargetGamma-aminobutyric acid receptor subunit alpha-6/beta-2/gamma-2
LigandBDBM50048855
Substrate/Competitorn/a
Meas. Tech.ChEMBL_70244 (CHEMBL680443)
Ki 13.2±n/a nM
Citation Mickelson, JWJacobsen, EJCarter, DBIm, HKIm, WBSchreur, PJSethy, VHTang, AHMcGee, JEPetke, JD High-affinity alpha-aminobutyric acid A/benzodiazepine ligands: synthesis and structure-activity relationship studies of a new series of tetracyclic imidazoquinoxalines. J Med Chem39:4654-66 (1996) 
 
Gamma-aminobutyric acid receptor subunit alpha-6/beta-2/gamma-2
Name:Gamma-aminobutyric acid receptor subunit alpha-6/beta-2/gamma-2
Type:n/a
Mol. Mass.:n/a
Description:ASSAY_ID of EBI is 70244
Components:This complex has 3 components.
Component 1
Name:Gamma-aminobutyric acid receptor subunit alpha-6
Synonyms:GABA A Alpha6Beta3Gamma2 GABA receptor alpha-6 subunit Gabra-6 Gamma-aminobutyric acid receptor subunit alpha-6
Type:Enzyme Catalytic Domain
Mol. Mass.:51188.24
Organism:RAT
Description:GABA A Alpha6Beta2Gamma2 0 RAT::P30191
Residue:453
Component 2
Name:Gamma-aminobutyric acid receptor subunit beta-2
Synonyms:GBRB2_RAT Gabrb2 | Gamma-aminobutyric acid receptor subunit beta-2 (GABA(A) beta-2)
Type:Enzyme
Mol. Mass.:54648.97
Organism:Rattus norvegicus (Rat)
Description:P63138
Residue:474
Component 3
Name:Gamma-aminobutyric acid receptor subunit gamma-2
Synonyms:GBRG2_RAT Gamma-aminobutyric acid receptor subunit gamma-2 (GABA(A) gamma-2)
Type:Enzyme
Mol. Mass.:54087.63
Organism:Rattus norvegicus (Rat)
Description:P18508
Residue:466
BDBM50048855
NameBDBM50048855
Synonyms:3-(5-Cyclopropyl-[1,2,4]oxadiazol-3-yl)-4H-imidazo[1,5-a]quinoxaline-5-carboxylic acid dimethylamide U-91571
TypeSmall organic molecule
Emp. Form.C18H18N6O2
Mol. Mass.350.3745
SMILESCN(C)C(=O)N1Cc2c(ncn2-c2ccccc12)-c1noc(n1)C1CC1