Reaction Details
Target11-beta-hydroxysteroid dehydrogenase 1
LigandBDBM29864
Substrate/Competitorn/a
Meas. Tech.ChEMBL_1813254 (CHEMBL4312828)
IC50 2070±n/a nM
Citation Ling, TMiller, DJLang, WHGriffith, ERodriguez-Cortes, AEl Ayachi, IPalacios, GMin, JMiranda-Carboni, GLee, RERivas, F Mechanistic Insight on the Mode of Action of Colletoic Acid. J Med Chem62:6925-6940 (2019) 
 
11-beta-hydroxysteroid dehydrogenase 1
Name:11-beta-hydroxysteroid dehydrogenase 1
Type:Enzyme
Mol. Mass.:32409.16
Organism:Homo sapiens (Human)
Description:P28845
Residue:292
BDBM29864
NameBDBM29864
Synonyms:N-(Pyridin-2-yl) arylsulfonamide, 26
TypeSmall organic molecule
Emp. Form.C18H14N4O2S
Mol. Mass.350.394
SMILESNc1cccc(NS(=O)(=O)c2ccc(cc2)-c2ccc(cc2)C#N)n1