Reaction Details
Target5-hydroxytryptamine receptor 7
LigandBDBM50504202
Substrate/Competitorn/a
Meas. Tech.ChEMBL_1813995 (CHEMBL4313569)
Ki 0.850000±n/a nM
Citation Romeo, GSalerno, LPittalą, VCandido, MIntagliata, SAmata, ESalmona, MCagnotto, ARescifina, AFloresta, GModica, MN [1]Benzothieno[3,2-d]pyrimidine derivatives as ligands for the serotonergic 5-HT Eur J Med Chem183:0 (2019) 
 
5-hydroxytryptamine receptor 7
Name:5-hydroxytryptamine receptor 7
Type:G Protein-Coupled Receptor (GPCR)
Mol. Mass.:53573.08
Organism:Homo sapiens (Human)
Description:P34969
Residue:479
BDBM50504202
NameBDBM50504202
Synonyms:CHEMBL4443201
TypeSmall organic molecule
Emp. Form.C20H24N4OS
Mol. Mass.368.496
SMILESO=c1[nH]c(CCCCN2CCN(CC2)c2ccccc2)nc2ccsc12