Reaction Details
Target5-hydroxytryptamine receptor 1A
LigandBDBM50504209
Substrate/Competitorn/a
Meas. Tech.ChEMBL_1813996 (CHEMBL4313570)
Ki 3.8±n/a nM
Citation Romeo, GSalerno, LPittalą, VCandido, MIntagliata, SAmata, ESalmona, MCagnotto, ARescifina, AFloresta, GModica, MN [1]Benzothieno[3,2-d]pyrimidine derivatives as ligands for the serotonergic 5-HT Eur J Med Chem183:0 (2019) 
 
5-hydroxytryptamine receptor 1A
Name:5-hydroxytryptamine receptor 1A
Type:n/a
Mol. Mass.:46122.49
Organism:Homo sapiens (Human)
Description:n/a
Residue:422
BDBM50504209
NameBDBM50504209
Synonyms:CHEMBL4441943
TypeSmall organic molecule
Emp. Form.C24H25ClN4OS
Mol. Mass.453
SMILESClc1cccc(c1)N1CCN(CCCCc2nc3c4ccccc4sc3c(=O)[nH]2)CC1