Reaction Details
Target5-hydroxytryptamine receptor 1A
LigandBDBM50504195
Substrate/Competitorn/a
Meas. Tech.ChEMBL_1813996 (CHEMBL4313570)
Ki 2.1±n/a nM
Citation Romeo, GSalerno, LPittalą, VCandido, MIntagliata, SAmata, ESalmona, MCagnotto, ARescifina, AFloresta, GModica, MN [1]Benzothieno[3,2-d]pyrimidine derivatives as ligands for the serotonergic 5-HT Eur J Med Chem183:0 (2019) 
 
5-hydroxytryptamine receptor 1A
Name:5-hydroxytryptamine receptor 1A
Type:n/a
Mol. Mass.:46122.49
Organism:Homo sapiens (Human)
Description:n/a
Residue:422
BDBM50504195
NameBDBM50504195
Synonyms:CHEMBL4561000
TypeSmall organic molecule
Emp. Form.C20H23ClN4OS
Mol. Mass.402.941
SMILESClc1cccc(c1)N1CCN(CCCCc2nc3ccsc3c(=O)[nH]2)CC1