Reaction Details
Target5-hydroxytryptamine receptor 7
LigandBDBM50504212
Substrate/Competitorn/a
Meas. Tech.ChEMBL_1813999 (CHEMBL4313573)
Ki 3.3±n/a nM
Citation Romeo, GSalerno, LPittalą, VCandido, MIntagliata, SAmata, ESalmona, MCagnotto, ARescifina, AFloresta, GModica, MN [1]Benzothieno[3,2-d]pyrimidine derivatives as ligands for the serotonergic 5-HT Eur J Med Chem183:0 (2019) 
 
5-hydroxytryptamine receptor 7
Name:5-hydroxytryptamine receptor 7
Type:G Protein-Coupled Receptor (GPCR)
Mol. Mass.:53573.08
Organism:Homo sapiens (Human)
Description:P34969
Residue:479
BDBM50504212
NameBDBM50504212
Synonyms:CHEMBL4527987
TypeSmall organic molecule
Emp. Form.C25H33N3O
Mol. Mass.391.549
SMILESO=C1NC2C=CC=C3CCCC1(CCCCN1CCN(CC1)c1ccccc1)C23