Reaction Details
Target5-hydroxytryptamine receptor 7
LigandBDBM50504201
Substrate/Competitorn/a
Meas. Tech.ChEMBL_1813995 (CHEMBL4313569)
Ki 3.4±n/a nM
Citation Romeo, GSalerno, LPittalą, VCandido, MIntagliata, SAmata, ESalmona, MCagnotto, ARescifina, AFloresta, GModica, MN [1]Benzothieno[3,2-d]pyrimidine derivatives as ligands for the serotonergic 5-HT Eur J Med Chem183:0 (2019) 
 
5-hydroxytryptamine receptor 7
Name:5-hydroxytryptamine receptor 7
Type:G Protein-Coupled Receptor (GPCR)
Mol. Mass.:53573.08
Organism:Homo sapiens (Human)
Description:P34969
Residue:479
BDBM50504201
NameBDBM50504201
Synonyms:CHEMBL4437217
TypeSmall organic molecule
Emp. Form.C25H28N4OS
Mol. Mass.432.581
SMILESCn1c(CCCCN2CCN(CC2)c2ccccc2)nc2c3ccccc3sc2c1=O