Reaction Details
Target5-hydroxytryptamine receptor 1B
LigandBDBM50054976
Substrate/Competitorn/a
Meas. Tech.ChEMBL_1596 (CHEMBL616623)
EC50 0.440000±n/a nM
Citation Halazy, SPerez, MFourrier, CPallard, IPauwels, PJPalmier, CJohn, GWValentin, JPBonnafous, RMartinez, J Serotonin dimers: application of the bivalent ligand approach to the design of new potent and selective 5-HT(1B/1D) agonists. J Med Chem39:4920-7 (1997) 
 
5-hydroxytryptamine receptor 1B
Name:5-hydroxytryptamine receptor 1B
Type:G Protein-Coupled Receptor (GPCR)
Mol. Mass.:43579.17
Organism:Homo sapiens (Human)
Description:Receptor binding assays were performed using human clone stably expressed in CHO cells
Residue:390
BDBM50054976
NameBDBM50054976
Synonyms:2-[3-(2-Amino-ethyl)-1H-indol-5-yloxy]-N-{2-[3-(2-amino-ethyl)-1H-indol-5-yloxy]-ethyl}-acetamide | CHEMBL147901
TypeSmall organic molecule
Emp. Form.C24H29N5O3
Mol. Mass.435.5188
SMILESNCCc1c[nH]c2ccc(OCCNC(=O)COc3ccc4[nH]cc(CCN)c4c3)cc12