Reaction Details
Target5-hydroxytryptamine receptor 1B
LigandBDBM50054978
Substrate/Competitorn/a
Meas. Tech.ChEMBL_1353 (CHEMBL616538)
Ki 0.320000±n/a nM
Citation Halazy, SPerez, MFourrier, CPallard, IPauwels, PJPalmier, CJohn, GWValentin, JPBonnafous, RMartinez, J Serotonin dimers: application of the bivalent ligand approach to the design of new potent and selective 5-HT(1B/1D) agonists. J Med Chem39:4920-7 (1997) 
 
5-hydroxytryptamine receptor 1B
Name:5-hydroxytryptamine receptor 1B
Type:G Protein-Coupled Receptor (GPCR)
Mol. Mass.:43579.17
Organism:Homo sapiens (Human)
Description:Receptor binding assays were performed using human clone stably expressed in CHO cells
Residue:390
BDBM50054978
NameBDBM50054978
Synonyms:2-(5-{3-[3-(2-Amino-ethyl)-1H-indol-5-yloxymethyl]-benzyloxy}-1H-indol-3-yl)-ethylamine | CHEMBL148022
TypeSmall organic molecule
Emp. Form.C28H30N4O2
Mol. Mass.454.5634
SMILESNCCc1c[nH]c2ccc(OCc3cccc(COc4ccc5[nH]cc(CCN)c5c4)c3)cc12