Reaction Details
Target5-hydroxytryptamine receptor 1D
LigandBDBM50054977
Substrate/Competitorn/a
Meas. Tech.ChEMBL_1723 (CHEMBL616928)
Ki 0.46±n/a nM
Citation Halazy, SPerez, MFourrier, CPallard, IPauwels, PJPalmier, CJohn, GWValentin, JPBonnafous, RMartinez, J Serotonin dimers: application of the bivalent ligand approach to the design of new potent and selective 5-HT(1B/1D) agonists. J Med Chem39:4920-7 (1997) 
 
5-hydroxytryptamine receptor 1D
Name:5-hydroxytryptamine receptor 1D
Type:G Protein-Coupled Receptor (GPCR)
Mol. Mass.:41920.63
Organism:Homo sapiens (Human)
Description:Receptor binding assays were performed using human clone stably expressed in CHO cells.
Residue:377
BDBM50054977
NameBDBM50054977
Synonyms:2-(5-{6-[3-(2-Amino-ethyl)-1H-indol-5-yloxy]-hexyloxy}-1H-indol-3-yl)-ethylamine | CHEMBL424128
TypeSmall organic molecule
Emp. Form.C26H34N4O2
Mol. Mass.434.5738
SMILESNCCc1c[nH]c2ccc(OCCCCCCOc3ccc4[nH]cc(CCN)c4c3)cc12