Reaction Details
Target5-hydroxytryptamine receptor 1D
LigandBDBM50054974
Substrate/Competitorn/a
Meas. Tech.ChEMBL_1723 (CHEMBL616928)
Ki 0.11±n/a nM
Citation Halazy, SPerez, MFourrier, CPallard, IPauwels, PJPalmier, CJohn, GWValentin, JPBonnafous, RMartinez, J Serotonin dimers: application of the bivalent ligand approach to the design of new potent and selective 5-HT(1B/1D) agonists. J Med Chem39:4920-7 (1997) 
 
5-hydroxytryptamine receptor 1D
Name:5-hydroxytryptamine receptor 1D
Type:G Protein-Coupled Receptor (GPCR)
Mol. Mass.:41920.63
Organism:Homo sapiens (Human)
Description:Receptor binding assays were performed using human clone stably expressed in CHO cells.
Residue:377
BDBM50054974
NameBDBM50054974
Synonyms:2-(5-((4-((3-(2-aminoethyl)-1H-indol-5-yloxy)methyl)phenyl)methoxy)-1H-indol-3-yl)ethanamine CHEMBL144030
TypeSmall organic molecule
Emp. Form.C28H30N4O2
Mol. Mass.454.5634
SMILESNCCc1c[nH]c2ccc(OCc3ccc(COc4ccc5[nH]cc(CCN)c5c4)cc3)cc12