Reaction Details
TargetLanosterol synthase
LigandBDBM50055643
Substrate/Competitorn/a
Meas. Tech.ChEMBL_148904 (CHEMBL756758)
Ki 500±n/a nM
Citation Stach, DZheng, YFPerez, ALOehlschlager, ACAbe, IPrestwich, GDHartman, PG Synthesis and inhibition studies of sulfur-substituted squalene oxide analogues as mechanism-based inhibitors of 2,3-oxidosqualene-lanosterol cyclase. J Med Chem40:201-9 (1997) 
 
Lanosterol synthase
Name:Lanosterol synthase
Type:PROTEIN
Mol. Mass.:83302.12
Organism:Rattus norvegicus
Description:ChEMBL_12083
Residue:733
BDBM50055643
NameBDBM50055643
Synonyms:2,2-Dimethyl-3-[(E)-3-methyl-7-((3E,7E)-4,8,12-trimethyl-trideca-3,7,11-trienylsulfanyl)-oct-3-enyl]-oxirane | CHEMBL64906
TypeSmall organic molecule
Emp. Form.C29H50OS
Mol. Mass.446.772
SMILES[#6]-[#6](-[#6]-[#6]\[#6]=[#6](/[#6])-[#6]-[#6]-[#6]1-[#8]C1([#6])[#6])-[#16]-[#6]-[#6]\[#6]=[#6](/[#6])-[#6]-[#6]\[#6]=[#6](/[#6])-[#6]-[#6]\[#6]=[#6](\[#6])-[#6]