Reaction Details
TargetLanosterol synthase
LigandBDBM50055641
Substrate/Competitorn/a
Meas. Tech.ChEMBL_148888 (CHEMBL758669)
IC50 0.22±n/a nM
Citation Stach, DZheng, YFPerez, ALOehlschlager, ACAbe, IPrestwich, GDHartman, PG Synthesis and inhibition studies of sulfur-substituted squalene oxide analogues as mechanism-based inhibitors of 2,3-oxidosqualene-lanosterol cyclase. J Med Chem40:201-9 (1997) 
 
Lanosterol synthase
Name:Lanosterol synthase
Type:PROTEIN
Mol. Mass.:83309.32
Organism:Homo sapiens (Human)
Description:ChEMBL_11231
Residue:732
BDBM50055641
NameBDBM50055641
Synonyms:2,2-dimethyl-3-((3E,7E,11E)-3,7,12-trimethyl-14-(6-methylhept-5-en-2-ylthio)tetradeca-3,7,11-trienyl)oxirane CHEMBL64905
TypeSmall organic molecule
Emp. Form.C29H50OS
Mol. Mass.446.772
SMILES[#6]-[#6](-[#6]-[#6]\[#6]=[#6](\[#6])-[#6])-[#16]-[#6]-[#6]\[#6](-[#6])=[#6]\[#6]-[#6]\[#6]=[#6](/[#6])-[#6]-[#6]\[#6]=[#6](/[#6])-[#6]-[#6]-[#6]1-[#8]C1([#6])[#6]