Reaction Details
TargetCarbonic anhydrase 5B, mitochondrial
LigandBDBM50504959
Substrate/Competitorn/a
Meas. Tech.ChEMBL_1816915 (CHEMBL4316489)
Kd 0.040000±n/a nM
Citation Zak?auskas, A?apkauskait?, EJezep?ikas, LLinkuvien?, VPaketuryt?, VSmirnov, ALeitans, JKazaks, ADvinskis, EManakova, EGra?ulis, STars, KMatulis, D Halogenated and di-substituted benzenesulfonamides as selective inhibitors of carbonic anhydrase isoforms. Eur J Med Chem185:0 (2020) 
 
Carbonic anhydrase 5B, mitochondrial
Name:Carbonic anhydrase 5B, mitochondrial
Type:Enzyme
Mol. Mass.:36440.83
Organism:Homo sapiens (Human)
Description:Human (cloned) isozyme
Residue:317
BDBM50504959
NameBDBM50504959
Synonyms:CHEMBL4543024
TypeSmall organic molecule
Emp. Form.C13H16ClNO4S2
Mol. Mass.349.853
SMILESNS(=O)(=O)c1cc(C(O)=O)c(SC2CCCCC2)cc1Cl