Reaction Details
TargetCarbonic anhydrase 5B, mitochondrial
LigandBDBM50504950
Substrate/Competitorn/a
Meas. Tech.ChEMBL_1816915 (CHEMBL4316489)
Kd 0.050000±n/a nM
Citation Zak?auskas, A?apkauskait?, EJezep?ikas, LLinkuvien?, VPaketuryt?, VSmirnov, ALeitans, JKazaks, ADvinskis, EManakova, EGra?ulis, STars, KMatulis, D Halogenated and di-substituted benzenesulfonamides as selective inhibitors of carbonic anhydrase isoforms. Eur J Med Chem185:0 (2020) 
 
Carbonic anhydrase 5B, mitochondrial
Name:Carbonic anhydrase 5B, mitochondrial
Type:Enzyme
Mol. Mass.:36440.83
Organism:Homo sapiens (Human)
Description:Human (cloned) isozyme
Residue:317
BDBM50504950
NameBDBM50504950
Synonyms:CHEMBL4573963
TypeSmall organic molecule
Emp. Form.C20H23ClN2O5S2
Mol. Mass.470.99
SMILESNS(=O)(=O)c1cc(C(=O)NCc2ccccc2)c(cc1Cl)S(=O)(=O)C1CCCCC1