Reaction Details
Target5-hydroxytryptamine receptor 1A
LigandBDBM50019960
Substrate/Competitorn/a
Meas. Tech.ChEMBL_1130 (CHEMBL616075)
Ki 1±n/a nM
Citation Kuipers, WKruse, CGvan Wijngaarden, IStandaar, PJTulp, MTVeldman, NSpek, ALIJzerman, AP 5-HT1A-versus D2-receptor selectivity of flesinoxan and analogous N4-substituted N1-arylpiperazines. J Med Chem40:300-12 (1997) 
 
5-hydroxytryptamine receptor 1A
Name:5-hydroxytryptamine receptor 1A
Type:G Protein-Coupled Receptor (GPCR)
Mol. Mass.:46445.29
Organism:Rattus norvegicus (rat)
Description:Binding assays were performed using rat hippocampal membranes.
Residue:422
BDBM50019960
NameBDBM50019960
Synonyms:4-Fluoro-N-{2-[4-(2-methoxy-phenyl)-piperazin-1-yl]-ethyl}-benzamide | CHEMBL58377
TypeSmall organic molecule
Emp. Form.C20H24FN3O2
Mol. Mass.357.4219
SMILESCOc1ccccc1N1CCN(CCNC(=O)c2ccc(F)cc2)CC1