Reaction Details
TargetD(2) dopamine receptor
LigandBDBM50039824
Substrate/Competitorn/a
Meas. Tech.ChEMBL_62255 (CHEMBL675482)
Ki 14±n/a nM
Citation Kuipers, WKruse, CGvan Wijngaarden, IStandaar, PJTulp, MTVeldman, NSpek, ALIJzerman, AP 5-HT1A-versus D2-receptor selectivity of flesinoxan and analogous N4-substituted N1-arylpiperazines. J Med Chem40:300-12 (1997) 
 
D(2) dopamine receptor
Name:D(2) dopamine receptor
Type:G Protein-Coupled Receptor (GPCR)
Mol. Mass.:50931.60
Organism:Rattus norvegicus (rat)
Description:P61169
Residue:444
BDBM50039824
NameBDBM50039824
Synonyms:CHEMBL81728 | N-{2-[4-(2,3-Dihydro-benzo[1,4]dioxin-5-yl)-piperazin-1-yl]-ethyl}-4-fluoro-benzamide
TypeSmall organic molecule
Emp. Form.C21H24FN3O3
Mol. Mass.385.432
SMILESFc1ccc(cc1)C(=O)NCCN1CCN(CC1)c1cccc2OCCOc12