Reaction Details
Target5-hydroxytryptamine receptor 1A
LigandBDBM50019959
Substrate/Competitorn/a
Meas. Tech.ChEMBL_1130 (CHEMBL616075)
Ki 1±n/a nM
Citation Kuipers, WKruse, CGvan Wijngaarden, IStandaar, PJTulp, MTVeldman, NSpek, ALIJzerman, AP 5-HT1A-versus D2-receptor selectivity of flesinoxan and analogous N4-substituted N1-arylpiperazines. J Med Chem40:300-12 (1997) 
 
5-hydroxytryptamine receptor 1A
Name:5-hydroxytryptamine receptor 1A
Type:G Protein-Coupled Receptor (GPCR)
Mol. Mass.:46445.29
Organism:Rattus norvegicus (rat)
Description:Binding assays were performed using rat hippocampal membranes.
Residue:422
BDBM50019959
NameBDBM50019959
Synonyms:1-(4-Fluoro-phenyl)-4-[4-(2-methoxy-phenyl)-piperazin-1-yl]-butan-1-one CHEMBL58792 | Fluanisone
TypeSmall organic molecule
Emp. Form.C21H25FN2O2
Mol. Mass.356.4338
SMILESCOc1ccccc1N1CCN(CCCC(=O)c2ccc(F)cc2)CC1