Reaction Details
TargetD(2) dopamine receptor
LigandBDBM50017543
Substrate/Competitorn/a
Meas. Tech.ChEMBL_61124 (CHEMBL672313)
Ki 4±n/a nM
Citation Heier, RFDolak, LADuncan, JNHyslop, DKLipton, MFMartin, IJMauragis, MAPiercey, MFNichols, NFSchreur, PJSmith, MWMoon, MW Synthesis and biological activities of (R)-5,6-dihydro-N,N-dimethyl-4H-imidazo[4,5,1-ij]quinolin-5-amine and its metabolites. J Med Chem40:639-46 (1997) 
 
D(2) dopamine receptor
Name:D(2) dopamine receptor
Type:Cell-surface receptors
Mol. Mass.:50647.10
Organism:Homo sapiens (Human)
Description:P14416
Residue:443
BDBM50017543
NameBDBM50017543
Synonyms:(6aR,9R,10aR)-9-Methylsulfanylmethyl-7-propyl-4,6,6a,7,8,9,10,10a-octahydro-indolo[4,3-fg]quinolin-7-ium 5-Bromo-7-methyl-4,6,6a,7,8,9-hexahydro-indolo[4,3-fg]quinoline-9-carboxylic acid (10b-hydroxy-5-isobutyl-2-isopropyl-3,6-dioxo-octahydro-oxazolo[3,2-a]pyrrolo[2,1-c]pyrazin-2-yl)-amide 9-Methylsulfanylmethyl-7-propyl-4,6,6a,7,8,9,10,10a-octahydro-indolo[4,3-fg]quinoline 9-Methylsulfanylmethyl-7-propyl-4,6,6a,7,8,9,10,10a-octahydro-indolo[4,3-fg]quinoline, mesylate (Pergolide) PERGOLIDE [2-(1H-Indol-4-yl)-ethyl]-methyl-amine | cid_47811
TypeSmall organic molecule
Emp. Form.C19H26N2S
Mol. Mass.314.488
SMILESCCCN1C[C@H](CSC)C[C@H]2[C@H]1Cc1c[nH]c3cccc2c13