Reaction Details
TargetThymidylate synthase
LigandBDBM50049941
Substrate/Competitorn/a
Meas. Tech.ChEMBL_208944 (CHEMBL814563)
Ki 160±n/a nM
Citation Jones, TRWebber, SEVarney, MDReddy, MRLewis, KKKathardekar, VMazdiyasni, HDeal, JNguyen, DWelsh, KMWebber, SJohnston, AMatthews, DASmith, WWJanson, CABacquet, RJHowland, EFBooth, CLHerrmann, SMWard, RWWhite, JBartlett, CAMorse, CA Structure-based design of substituted diphenyl sulfones and sulfoxides as lipophilic inhibitors of thymidylate synthase. J Med Chem40:677-83 (1997) 
 
Thymidylate synthase
Name:Thymidylate synthase
Type:Enzyme
Mol. Mass.:35718.07
Organism:Homo sapiens (Human)
Description:n/a
Residue:313
BDBM50049941
NameBDBM50049941
Synonyms:6-{[(4-Benzenesulfinyl-phenyl)-prop-2-ynyl-amino]-methyl}-2-methyl-3H-quinazolin-4-one | CHEMBL162754
TypeSmall organic molecule
Emp. Form.C25H21N3O2S
Mol. Mass.427.518
SMILESCc1nc2ccc(CN(CC#C)c3ccc(cc3)S(=O)c3ccccc3)cc2c(=O)[nH]1