Reaction Details
TargetProstaglandin G/H synthase 1
LigandBDBM85245
Substrate/Competitorn/a
Meas. Tech.ChEMBL_158727 (CHEMBL768735)
IC50 1300±n/a nM
Citation Lazer, ESMiao, CKCywin, CLSorcek, RWong, HCMeng, ZPotocki, IHoermann, MSnow, RJTschantz, MAKelly, TAMcNeil, DWCoutts, SJChurchill, LGraham, AGDavid, EGrob, PMEngel, WMeier, HTrummlitz, G Effect of structural modification of enol-carboxamide-type nonsteroidal antiinflammatory drugs on COX-2/COX-1 selectivity. J Med Chem40:980-9 (1997) 
 
Prostaglandin G/H synthase 1
Name:Prostaglandin G/H synthase 1
Type:Enzyme
Mol. Mass.:68692.62
Organism:Homo sapiens (Human)
Description:P23219
Residue:599
BDBM85245
NameBDBM85245
Synonyms:CAS_36322-90-4 Piroxicam
TypeSmall organic molecule
Emp. Form.C15H13N3O4S
Mol. Mass.331.346
SMILESCN1C(C(=O)Nc2ccccn2)=C(O)c2ccccc2S1(=O)=O