Reaction Details
TargetEndothelin-1 receptor
LigandBDBM50057181
Substrate/Competitorn/a
Meas. Tech.ChEMBL_65465 (CHEMBL682105)
IC50 1.7±n/a nM
Citation Patt, WCEdmunds, JJRepine, JTBerryman, KAReisdorph, BRLee, CPlummer, MSShahripour, AHaleen, SJKeiser, JAFlynn, MAWelch, KMReynolds, EERubin, RTobias, BHallak, HDoherty, AM Structure-activity relationships in a series of orally active gamma-hydroxy butenolide endothelin antagonists. J Med Chem40:1063-74 (1997) 
 
Endothelin-1 receptor
Name:Endothelin-1 receptor
Type:Enzyme Catalytic Domain
Mol. Mass.:48736.88
Organism:Homo sapiens (Human)
Description:P25101
Residue:427
BDBM50057181
NameBDBM50057181
Synonyms:3-Benzo[1,3]dioxol-5-yl-4-(3,5-dimethoxy-benzyl)-5-hydroxy-5-(4-methoxy-phenyl)-5H-furan-2-one | CHEMBL274359
TypeSmall organic molecule
Emp. Form.C27H24O8
Mol. Mass.476.4747
SMILESCOc1ccc(cc1)C1(O)OC(=O)C(=C1Cc1cc(OC)cc(OC)c1)c1ccc2OCOc2c1